Target
Platelet-derived growth factor receptor alpha
Ligand
BDBM50384888
Substrate
Meas. Tech.
ChEMBL_821820 (CHEMBL2039264)
IC50
>3000±n/a nM
Citation
 Cha, MYLee, KOKang, SJJung, YHSong, JYChoi, KJByun, JYLee, HJLee, GSPark, SBKim, MS Synthesis and biological evaluation of pyrimidine-based dual inhibitors of human epidermal growth factor receptor 1 (HER-1) and HER-2 tyrosine kinases. J Med Chem 55:2846-57 (2012)  
Target
Name:
Platelet-derived growth factor receptor alpha
Synonyms:
Alpha-type platelet-derived growth factor receptor PDGFRA PGFRA_HUMAN Platelet-derived growth factor receptor alpha (PDGFRA) RHEPDGFRA
Type:
Protein
Mol. Mass.:
122633.38
Organism:
Homo sapiens (Human)
Description:
P16234
Residue:
1089
  
Inhibitor
Name:
BDBM50384888
Synonyms:
CHEMBL2035810
Type:
Small organic molecule
Emp. Form.:
C23H20ClN7O3
Mol. Mass.:
477.903
SMILES:
Nc1ncnc(Nc2ccc(OCc3ccccn3)c(Cl)c2)c1-c1nc(CNC(=O)C=C)co1
: