Target
Glycylpeptide N-tetradecanoyltransferase 2
Ligand
BDBM50384915
Substrate
Meas. Tech.
ChEMBL_820573 (CHEMBL2040310)
Ki
>100000±n/a nM
Citation
 Goncalves, VBrannigan, JAWhalley, DAnsell, KHSaxty, BHolder, AAWilkinson, AJTate, EWLeatherbarrow, RJ Discovery of Plasmodium vivax N-myristoyltransferase inhibitors: screening, synthesis, and structural characterization of their binding mode. J Med Chem 55:3578-82 (2012)  
Target
Name:
Glycylpeptide N-tetradecanoyltransferase 2
Synonyms:
Glycylpeptide N-tetradecanoyltransferase 2 NMT 2 NMT2_HUMAN Type II N-myristoyltransferase
Type:
PROTEIN
Mol. Mass.:
56986.61
Organism:
Homo sapiens (Human)
Description:
ChEMBL_1435042
Residue:
498
  
Inhibitor
Name:
BDBM50384915
Synonyms:
CHEMBL2036503
Type:
Small organic molecule
Emp. Form.:
C15H14N2O2S
Mol. Mass.:
286.349
SMILES:
CCOC(=O)c1cnc2ccccc2c1SCCC#N
: