Target
Histamine H3 receptor
Ligand
BDBM50384927
Substrate
Meas. Tech.
ChEMBL_820600 (CHEMBL2040489)
Ki
3.2±n/a nM
Citation
 Zulli, ALAimone, LDMathiasen, JRGruner, JARaddatz, RBacon, ERHudkins, RL Substituted phenoxypropyl-(R)-2-methylpyrrolidine aminomethyl ketones as histamine-3 receptor inverse agonists. Bioorg Med Chem Lett 22:2807-10 (2012)  
Target
Name:
Histamine H3 receptor
Synonyms:
G-protein coupled receptor 97 HH3R HRH3 Histamine H3 receptor (H3) Histamine receptor (H3 and H4)
Type:
G Protein-Coupled Receptor (GPCR)
Mol. Mass.:
48691.47
Organism:
Homo sapiens (Human)
Description:
Binding assays were using CHO cells stably expressing hH3R receptors.
Residue:
445
  
Inhibitor
Name:
BDBM50384927
Synonyms:
CHEMBL2036653
Type:
Small organic molecule
Emp. Form.:
C22H33N3O4
Mol. Mass.:
403.5151
SMILES:
COC(=O)N1CCN(CC(=O)c2ccc(OCCCN3CCC[C@H]3C)cc2)CC1
: