Target
5-hydroxytryptamine receptor 1A
Ligand
BDBM50384954
Substrate
Meas. Tech.
ChEMBL_821405 (CHEMBL2037806)
Ki
6.6±n/a nM
Citation
 Zhu, XYEtukala, JREyunni, SVSetola, VRoth, BLAblordeppey, SY Benzothiazoles as probes for the 5HT1A receptor and the serotonin transporter (SERT): a search for new dual-acting agents as potential antidepressants. Eur J Med Chem 53:124-32 (2012)  
Target
Name:
5-hydroxytryptamine receptor 1A
Synonyms:
5-HT-1A 5-hydroxytryptamine receptor 1A (5-HT-1A) ADRB2RL1 Dopamine D2 receptor and serotonin 1a receptor HTR1A | Serotonin receptor 1A
Type:
Mol. Mass.:
46122.49
Organism:
Homo sapiens (Human)
Description:
Residue:
422
  
Inhibitor
Name:
BDBM50384954
Synonyms:
CHEMBL2037521
Type:
Small organic molecule
Emp. Form.:
C19H23N5S
Mol. Mass.:
353.484
SMILES:
C(CCc1nc2ccccc2s1)CN1CCN(CC1)c1ncccn1
: