Target
5-hydroxytryptamine receptor 2A
Ligand
BDBM50363899
Substrate
Meas. Tech.
ChEMBL_821407 (CHEMBL2037808)
Ki
1003±n/a nM
Citation
 Zhu, XYEtukala, JREyunni, SVSetola, VRoth, BLAblordeppey, SY Benzothiazoles as probes for the 5HT1A receptor and the serotonin transporter (SERT): a search for new dual-acting agents as potential antidepressants. Eur J Med Chem 53:124-32 (2012)  
Target
Name:
5-hydroxytryptamine receptor 2A
Synonyms:
5-HT-2 5-HT2A 5-hydroxytryptamine receptor 2A (5HT-2A) 5HT2A_HUMAN HTR2A | Serotonin receptor 2A
Type:
undefined
Mol. Mass.:
52607.65
Organism:
Homo sapiens (Human)
Description:
P28223
Residue:
471
  
Inhibitor
Name:
BDBM50363899
Synonyms:
CHEMBL1946257
Type:
Small organic molecule
Emp. Form.:
C23H26ClN3OS
Mol. Mass.:
427.99
SMILES:
Clc1ccc(cc1)N1CCCN(CCCCC(=O)c2nc3ccccc3s2)CC1
: