Target
5-hydroxytryptamine receptor 2C
Ligand
BDBM50384955
Substrate
Meas. Tech.
ChEMBL_821408 (CHEMBL2037809)
Ki
6265±n/a nM
Citation
 Zhu, XYEtukala, JREyunni, SVSetola, VRoth, BLAblordeppey, SY Benzothiazoles as probes for the 5HT1A receptor and the serotonin transporter (SERT): a search for new dual-acting agents as potential antidepressants. Eur J Med Chem 53:124-32 (2012)  
Target
Name:
5-hydroxytryptamine receptor 2C
Synonyms:
5-HT-2C 5-HT2C-INI 5-HTR2C 5-hydroxytryptamine receptor 2C (5-HT-2C) 5HT-1C HTR1C Serotonin (5-HT3) receptor Serotonin Receptor 2C
Type:
G Protein-Coupled Receptor (GPCR)
Mol. Mass.:
51836.79
Organism:
Homo sapiens (Human)
Description:
P28335
Residue:
458
  
Inhibitor
Name:
BDBM50384955
Synonyms:
CHEMBL2037522
Type:
Small organic molecule
Emp. Form.:
C20H22N2S
Mol. Mass.:
322.467
SMILES:
C(CCc1nc2ccccc2s1)CN1CCc2ccccc2C1
: