Target
5-hydroxytryptamine receptor 7
Ligand
BDBM50363900
Substrate
Meas. Tech.
ChEMBL_821409 (CHEMBL2037810)
Ki
356±n/a nM
Citation
 Zhu, XYEtukala, JREyunni, SVSetola, VRoth, BLAblordeppey, SY Benzothiazoles as probes for the 5HT1A receptor and the serotonin transporter (SERT): a search for new dual-acting agents as potential antidepressants. Eur J Med Chem 53:124-32 (2012)  
Target
Name:
5-hydroxytryptamine receptor 7
Synonyms:
5-HT-7 5-HT7 5-HT7S 5HT7 HTR7 | Serotonin receptor 7
Type:
G Protein-Coupled Receptor (GPCR)
Mol. Mass.:
53573.08
Organism:
Homo sapiens (Human)
Description:
P34969
Residue:
479
  
Inhibitor
Name:
BDBM50363900
Synonyms:
CHEMBL1946258
Type:
Small organic molecule
Emp. Form.:
C22H24ClN3OS
Mol. Mass.:
413.963
SMILES:
Clc1ccc(cc1)N1CCCN(CCCC(=O)c2nc3ccccc3s2)CC1
: