Target
D(2) dopamine receptor
Ligand
BDBM50151982
Substrate
Meas. Tech.
ChEMBL_820694 (CHEMBL2037965)
Ki
666±n/a nM
Citation
 Zhu, XYEtukala, JREyunni, SVSetola, VRoth, BLAblordeppey, SY Benzothiazoles as probes for the 5HT1A receptor and the serotonin transporter (SERT): a search for new dual-acting agents as potential antidepressants. Eur J Med Chem 53:124-32 (2012)  
Target
Name:
D(2) dopamine receptor
Synonyms:
D(2) dopamine receptor DOPAMINE D2 Long DRD2 Dopamine D2 receptor Dopamine D2 receptor (D2R) Dopamine2-like | d2
Type:
Cell-surface receptors
Mol. Mass.:
50647.10
Organism:
Homo sapiens (Human)
Description:
P14416
Residue:
443
  
Inhibitor
Name:
BDBM50151982
Synonyms:
5-{4-[4-(5-Cyano-1H-indol-3-yl)-butyl]-piperazin-1-yl}-benzofuran-2-carboxylic acid amide VILAZODONE
Type:
Small organic molecule
Emp. Form.:
C26H27N5O2
Mol. Mass.:
441.5249
SMILES:
NC(=O)c1cc2cc(ccc2o1)N1CCN(CCCCc2c[nH]c3ccc(cc23)C#N)CC1
: