Target
Serine/threonine-protein kinase pim-2
Ligand
BDBM50385094
Substrate
Meas. Tech.
ChEMBL_821479 (CHEMBL2038009)
IC50
3755±n/a nM
Citation
 Tsuhako, ALBrown, DSKoltun, ESAay, NArcalas, AChan, VDu, HEngst, SFranzini, MGalan, AHuang, PJohnston, SKane, BKim, MHLaird, ADLin, RMock, LNgan, IPack, MStott, GStout, TJYu, PZaharia, CZhang, WZhou, PNuss, JMKearney, PCXu, W The design, synthesis, and biological evaluation of PIM kinase inhibitors. Bioorg Med Chem Lett 22:3732-8 (2012)  
Target
Name:
Serine/threonine-protein kinase pim-2
Synonyms:
PIM2 Pim-2h Serine/threonine-protein kinase PIM | Serine/threonine-protein kinase pim-2 (PIM2)
Type:
Serine/threonine-protein kinase
Mol. Mass.:
34185.93
Organism:
Homo sapiens (Human)
Description:
Q9P1W9
Residue:
311
  
Inhibitor
Name:
BDBM50385094
Synonyms:
CHEMBL2035606
Type:
Small organic molecule
Emp. Form.:
C16H9ClN2O3
Mol. Mass.:
312.707
SMILES:
Oc1ccc2oc3c(nc([nH]c3=O)-c3ccccc3Cl)c2c1
: