Target
Serine/threonine-protein kinase pim-3
Ligand
BDBM50385084
Substrate
Meas. Tech.
ChEMBL_821480 (CHEMBL2038010)
IC50
18±n/a nM
Citation
 Tsuhako, ALBrown, DSKoltun, ESAay, NArcalas, AChan, VDu, HEngst, SFranzini, MGalan, AHuang, PJohnston, SKane, BKim, MHLaird, ADLin, RMock, LNgan, IPack, MStott, GStout, TJYu, PZaharia, CZhang, WZhou, PNuss, JMKearney, PCXu, W The design, synthesis, and biological evaluation of PIM kinase inhibitors. Bioorg Med Chem Lett 22:3732-8 (2012)  
Target
Name:
Serine/threonine-protein kinase pim-3
Synonyms:
PIM3 Serine/threonine-protein kinase pim-3 (PIM3)
Type:
Protein
Mol. Mass.:
35888.19
Organism:
Homo sapiens (Human)
Description:
Q86V86
Residue:
326
  
Inhibitor
Name:
BDBM50385084
Synonyms:
CHEMBL2035636
Type:
Small organic molecule
Emp. Form.:
C18H19BrN4O2
Mol. Mass.:
403.273
SMILES:
CN1C[C@@H]2CC[C@H]1CN2Cc1nc2c3cc(Br)ccc3oc2c(=O)[nH]1
: