Target
Prostaglandin E2 receptor EP2 subtype
Ligand
BDBM50385133
Substrate
Meas. Tech.
ChEMBL_822927 (CHEMBL2038098)
Ki
15±n/a nM
Citation
 Kambe, TMaruyama, TNakai, YOida, HMaruyama, TAbe, NNishiura, ANakai, HToda, M Synthesis and evaluation of¿-lactam analogs of PGE2 as EP4 and EP2/EP4 agonists. Bioorg Med Chem 20:3502-22 (2012)  
Target
Name:
Prostaglandin E2 receptor EP2 subtype
Synonyms:
PE2R2_MOUSE Prostaglandin E2 Prostanoid EP2 receptor Ptgerep2
Type:
G-protein coupled receptor
Mol. Mass.:
40495.26
Organism:
Mus musculus (Mouse)
Description:
Residue:
362
  
Inhibitor
Name:
BDBM50385133
Synonyms:
CHEMBL2036324
Type:
Small organic molecule
Emp. Form.:
C27H25N3O4S3
Mol. Mass.:
551.7
SMILES:
O[C@@H](Cc1cccc(c1)-c1nc2ccccc2s1)\C=C\[C@H]1CCC(=O)N1CCSc1nc(cs1)C(O)=O
: