Target
Prostaglandin E2 receptor EP3 subtype
Ligand
BDBM50385128
Substrate
Meas. Tech.
ChEMBL_822928 (CHEMBL2038099)
Ki
>10000±n/a nM
Citation
 Kambe, TMaruyama, TNakai, YOida, HMaruyama, TAbe, NNishiura, ANakai, HToda, M Synthesis and evaluation of¿-lactam analogs of PGE2 as EP4 and EP2/EP4 agonists. Bioorg Med Chem 20:3502-22 (2012)  
Target
Name:
Prostaglandin E2 receptor EP3 subtype
Synonyms:
PE2R3_MOUSE Prostaglandin E2 receptor EP3 isoform alpha Prostanoid EP3 receptor Ptgerep3
Type:
G-protein coupled receptor
Mol. Mass.:
40092.50
Organism:
Mus musculus (Mouse)
Description:
Residue:
365
  
Inhibitor
Name:
BDBM50385128
Synonyms:
CHEMBL2036318
Type:
Small organic molecule
Emp. Form.:
C27H28N2O4S2
Mol. Mass.:
508.652
SMILES:
Cc1ccc(cc1)-c1cccc(C[C@H](O)\C=C\[C@H]2CCC(=O)N2CCSc2nc(cs2)C(O)=O)c1
: