Target
Prostaglandin E2 receptor EP4 subtype
Ligand
BDBM50385126
Substrate
Meas. Tech.
ChEMBL_822931 (CHEMBL2038102)
EC50
0.61±n/a nM
Citation
 Kambe, TMaruyama, TNakai, YOida, HMaruyama, TAbe, NNishiura, ANakai, HToda, M Synthesis and evaluation of¿-lactam analogs of PGE2 as EP4 and EP2/EP4 agonists. Bioorg Med Chem 20:3502-22 (2012)  
Target
Name:
Prostaglandin E2 receptor EP4 subtype
Synonyms:
PE2R4_RAT Ptger4
Type:
PROTEIN
Mol. Mass.:
53381.95
Organism:
Rattus norvegicus
Description:
ChEMBL_1290039
Residue:
488
  
Inhibitor
Name:
BDBM50385126
Synonyms:
CHEMBL2036316
Type:
Small organic molecule
Emp. Form.:
C26H32N2O5S
Mol. Mass.:
484.608
SMILES:
O[C@@H](Cc1cccc(OCc2ccccn2)c1)\C=C\[C@H]1CCC(=O)N1CCSCCCC(O)=O
: