Target
Prostaglandin E2 receptor EP3 subtype
Ligand
BDBM50366137
Substrate
Meas. Tech.
ChEMBL_822928 (CHEMBL2038099)
Ki
>10000±n/a nM
Citation
 Kambe, TMaruyama, TNakai, YOida, HMaruyama, TAbe, NNishiura, ANakai, HToda, M Synthesis and evaluation of¿-lactam analogs of PGE2 as EP4 and EP2/EP4 agonists. Bioorg Med Chem 20:3502-22 (2012)  
Target
Name:
Prostaglandin E2 receptor EP3 subtype
Synonyms:
PE2R3_MOUSE Prostaglandin E2 receptor EP3 isoform alpha Prostanoid EP3 receptor Ptgerep3
Type:
G-protein coupled receptor
Mol. Mass.:
40092.50
Organism:
Mus musculus (Mouse)
Description:
Residue:
365
  
Inhibitor
Name:
BDBM50366137
Synonyms:
CHEMBL1957436
Type:
Small organic molecule
Emp. Form.:
C26H25ClN2O4S2
Mol. Mass.:
529.071
SMILES:
O[C@@H](Cc1cccc(c1)-c1ccc(Cl)cc1)\C=C\[C@H]1CCC(=O)N1CCSc1nc(cs1)C(O)=O
: