Target
Peroxisome proliferator-activated receptor delta
Ligand
BDBM50126016
Substrate
Meas. Tech.
ChEMBL_822293 (CHEMBL2038596)
IC50
4±n/a nM
Citation
 Méndez-Lucio, OPérez-Villanueva, JCastillo, RMedina-Franco, JL Activity landscape modeling of PPAR ligands with dual-activity difference maps. Bioorg Med Chem 20:3523-32 (2012)  
Target
Name:
Peroxisome proliferator-activated receptor delta
Synonyms:
NR1C2 NUCI Nuclear receptor subfamily 1 group C member 2 PPAR-beta PPARD Peroxisome proliferator-activated receptor Peroxisome proliferator-activated receptor delta
Type:
Enzyme
Mol. Mass.:
49910.45
Organism:
Homo sapiens (Human)
Description:
Q03181
Residue:
441
  
Inhibitor
Name:
BDBM50126016
Synonyms:
2-(3-chloro-4-(3-(3-ethyl-7-propylbenzo[d]isoxazol-6-yloxy)propylthio)phenyl)acetic acid {3-Chloro-4-[3-(3-ethyl-7-propyl-benzo[d]isoxazol-6-yloxy)-propylsulfanyl]-phenyl}-acetic acid
Type:
Small organic molecule
Emp. Form.:
C23H26ClNO4S
Mol. Mass.:
447.975
SMILES:
CCCc1c(OCCCSc2ccc(CC(O)=O)cc2Cl)ccc2c(CC)noc12
: