Target
Peroxisome proliferator-activated receptor delta
Ligand
BDBM50199776
Substrate
Meas. Tech.
ChEMBL_822293 (CHEMBL2038596)
IC50
3±n/a nM
Citation
 Méndez-Lucio, OPérez-Villanueva, JCastillo, RMedina-Franco, JL Activity landscape modeling of PPAR ligands with dual-activity difference maps. Bioorg Med Chem 20:3523-32 (2012)  
Target
Name:
Peroxisome proliferator-activated receptor delta
Synonyms:
NR1C2 NUCI Nuclear receptor subfamily 1 group C member 2 PPAR-beta PPARD Peroxisome proliferator-activated receptor Peroxisome proliferator-activated receptor delta
Type:
Enzyme
Mol. Mass.:
49910.45
Organism:
Homo sapiens (Human)
Description:
Q03181
Residue:
441
  
Inhibitor
Name:
BDBM50199776
Synonyms:
3-(2-ethyl-4-((R)-3-(4-ethyl-2-(pyridin-2-yl)phenoxy)butoxy)phenyl)propanoic acid | CHEMBL241479
Type:
Small organic molecule
Emp. Form.:
C28H33NO4
Mol. Mass.:
447.5659
SMILES:
CCc1ccc(O[C@H](C)CCOc2ccc(CCC(O)=O)c(CC)c2)c(c1)-c1ccccn1
: