Target
Bile acid receptor
Ligand
BDBM50385216
Substrate
Meas. Tech.
ChEMBL_822295 (CHEMBL2038598)
EC50
3500±n/a nM
Citation
 Marinozzi, MCarotti, ASansone, EMacchiarulo, ARosatelli, ESardella, RNatalini, BRizzo, GAdorini, LPasseri, DDe Franco, FPruzanski, MPellicciari, R Pyrazole[3,4-e][1,4]thiazepin-7-one derivatives as a novel class of Farnesoid X Receptor (FXR) agonists. Bioorg Med Chem 20:3429-45 (2012)  
Target
Name:
Bile acid receptor
Synonyms:
BAR FXR HRR1 NR1H4_HUMAN RIP14 Retinoid X receptor-interacting protein 14 | farnesoid x receptor
Type:
Nuclear Receptor
Mol. Mass.:
55916.24
Organism:
Homo sapiens (Human)
Description:
Q96RI1
Residue:
486
  
Inhibitor
Name:
BDBM50385216
Synonyms:
CHEMBL2037306
Type:
Small organic molecule
Emp. Form.:
C25H23N3O2S
Mol. Mass.:
429.534
SMILES:
C[C@@H]1S[C@@H](c2c(C)nn(c2NC1=O)-c1ccccc1C)c1ccc(cc1)-c1ccoc1
: