Target
Histamine H4 receptor
Ligand
BDBM50385243
Substrate
Meas. Tech.
ChEMBL_822396 (CHEMBL2038944)
Ki
>10000±n/a nM
Citation
 Becknell, NCLyons, JAAimone, LDHuang, ZGruner, JARaddatz, RHudkins, RL Synthesis and evaluation of 4- and 5-pyridazin-3-one phenoxypropylamine analogues as histamine-3 receptor antagonists. Bioorg Med Chem 20:3880-6 (2012)  
Target
Name:
Histamine H4 receptor
Synonyms:
AXOR35 GPCR105 HH4R HRH4 Histamine H4 receptor Histamine receptor (H3 and H4) SP9144
Type:
G Protein-Coupled Receptor (GPCR)
Mol. Mass.:
44517.02
Organism:
Homo sapiens (Human)
Description:
Binding assays were using CHO cells stably expressing hH4R receptors.
Residue:
390
  
Inhibitor
Name:
BDBM50385243
Synonyms:
CHEMBL2037608
Type:
Small organic molecule
Emp. Form.:
C20H27N3O3
Mol. Mass.:
357.4467
SMILES:
COCn1ncc(cc1=O)-c1ccc(OCCCN2CCC[C@H]2C)cc1
: