Target
Thioredoxin reductase 1, cytoplasmic
Ligand
BDBM50385290
Substrate
Meas. Tech.
ChEMBL_822563 (CHEMBL2039583)
IC50
4910±n/a nM
Citation
 He, JLi, DXiong, KGe, YJin, HZhang, GHong, MTian, YYin, JZeng, H Inhibition of thioredoxin reductase by a novel series of bis-1,2-benzisoselenazol-3(2H)-ones: Organoselenium compounds for cancer therapy. Bioorg Med Chem 20:3816-27 (2012)  
Target
Name:
Thioredoxin reductase 1, cytoplasmic
Synonyms:
NADPH-dependent thioredoxin reductase TRXR1_RAT Trxr1 | Txnrd1
Type:
PROTEIN
Mol. Mass.:
54519.34
Organism:
Rattus norvegicus
Description:
ChEMBL_589950
Residue:
498
  
Inhibitor
Name:
BDBM50385290
Synonyms:
CHEMBL2035474
Type:
Small organic molecule
Emp. Form.:
C22H24N2O2Se2
Mol. Mass.:
506.36
SMILES:
Cc1ccc2[se]n(CCCCCCn3[se]c4ccc(C)cc4c3=O)c(=O)c2c1
: