Target
Thioredoxin reductase 1, cytoplasmic
Ligand
BDBM50385300
Substrate
Meas. Tech.
ChEMBL_822563 (CHEMBL2039583)
IC50
1950±n/a nM
Citation
 He, JLi, DXiong, KGe, YJin, HZhang, GHong, MTian, YYin, JZeng, H Inhibition of thioredoxin reductase by a novel series of bis-1,2-benzisoselenazol-3(2H)-ones: Organoselenium compounds for cancer therapy. Bioorg Med Chem 20:3816-27 (2012)  
Target
Name:
Thioredoxin reductase 1, cytoplasmic
Synonyms:
NADPH-dependent thioredoxin reductase TRXR1_RAT Trxr1 | Txnrd1
Type:
PROTEIN
Mol. Mass.:
54519.34
Organism:
Rattus norvegicus
Description:
ChEMBL_589950
Residue:
498
  
Inhibitor
Name:
BDBM50385300
Synonyms:
CHEMBL2035463
Type:
Small organic molecule
Emp. Form.:
C19H18N2O2Se2
Mol. Mass.:
464.28
SMILES:
O=c1n(CCCCCn2[se]c3ccccc3c2=O)[se]c2ccccc12
: