Target
Polymerase acidic protein
Ligand
BDBM33410
Substrate
Meas. Tech.
ChEMBL_823234 (CHEMBL2040652)
EC50
3220±n/a nM
Citation
 Baughman, BMJake Slavish, PDuBois, RMBoyd, VAWhite, SWWebb, TR Identification of influenza endonuclease inhibitors using a novel fluorescence polarization assay. ACS Chem Biol 7:526-34 (2012)  
Target
Name:
Polymerase acidic protein
Synonyms:
Hepatitis C virus polyprotein PA/PB1 Polymerase acidic protein | RNA-directed RNA polymerase subunit P2
Type:
PROTEIN
Mol. Mass.:
82573.84
Organism:
Hepatitis C virus
Description:
ChEMBL_64976
Residue:
716
  
Inhibitor
Name:
BDBM33410
Synonyms:
CHEMBL16755 | N-hydroxyisoquinolinedione, 2
Type:
Small organic molecule
Emp. Form.:
C9H7NO3
Mol. Mass.:
177.1568
SMILES:
ON1C(=O)Cc2ccccc2C1=O
: