Target
Polymerase acidic protein
Ligand
BDBM50385532
Substrate
Meas. Tech.
ChEMBL_823246 (CHEMBL2040664)
IC50
1500±n/a nM
Citation
 Singh, SBTomassini, JE Synthesis of natural flutimide and analogous fully substituted pyrazine-2,6-diones, endonuclease inhibitors of influenza virus. J Org Chem 66:5504-16 (2001)  
Target
Name:
Polymerase acidic protein
Synonyms:
Hepatitis C virus polyprotein PA/PB1 Polymerase acidic protein | RNA-directed RNA polymerase subunit P2
Type:
PROTEIN
Mol. Mass.:
82573.84
Organism:
Hepatitis C virus
Description:
ChEMBL_64976
Residue:
716
  
Inhibitor
Name:
BDBM50385532
Synonyms:
CHEMBL2040603
Type:
Small organic molecule
Emp. Form.:
C15H15FN2O3
Mol. Mass.:
290.2896
SMILES:
CC(C)C=c1[nH]c(=Cc2cccc(F)c2)c(=O)n(O)c1=O
: