Target
ALK tyrosine kinase receptor
Ligand
BDBM50334081
Substrate
Meas. Tech.
ChEMBL_825874 (CHEMBL2044751)
IC50
15±n/a nM
Citation
 Ott, GRTripathy, RCheng, MMcHugh, RAnzalone, AVUnderiner, TLCurry, MAQuail, MRLu, LWan, WAngeles, TSAlbom, MSAimone, LDAtor, MARuggeri, BADorsey, BD Discovery of a potent inhibitor of anaplastic lymphoma kinase with in vivo antitumor activity. ACS Med Chem Lett 1:493-498 (2010)  
Target
Name:
ALK tyrosine kinase receptor
Synonyms:
ALK ALK_HUMAN CD_antigen: CD246
Type:
Protein
Mol. Mass.:
176453.10
Organism:
Homo sapiens (Human)
Description:
Q9UM73
Residue:
1620
  
Inhibitor
Name:
BDBM50334081
Synonyms:
2-[5-Chloro-2-(1-methyl-2-oxo-2,3,4,5-tetrahydro-1H-benzo[b]azepin-7-ylamino)-pyrimidin-4-ylamino]-N-methyl-benzamide | CHEMBL1644799
Type:
Small organic molecule
Emp. Form.:
C23H23ClN6O2
Mol. Mass.:
450.921
SMILES:
CNC(=O)c1ccccc1Nc1nc(Nc2ccc3N(C)C(=O)CCCc3c2)ncc1Cl
: