Target
C-X-C chemokine receptor type 4
Ligand
BDBM50363984
Substrate
Meas. Tech.
ChEMBL_825943 (CHEMBL2044967)
IC50
37±n/a nM
Citation
 Inokuchi, EOishi, SKubo, TOhno, HShimura, KMatsuoka, MFujii, N Potent CXCR4 antagonists containing amidine type Peptide bond isosteres. ACS Med Chem Lett 2:477-480 (2011)  
Target
Name:
C-X-C chemokine receptor type 4
Synonyms:
C-X-C chemokine receptor type 4 CD_antigen=CD184 CXCR-4 CXCR4_HUMAN Fusin LCR1 Leukocyte-derived seven transmembrane domain receptor SDF-1 receptor | Stromal cell-derived factor 1 receptor
Type:
Enzyme
Mol. Mass.:
39754.61
Organism:
Homo sapiens (Human)
Description:
P61073
Residue:
352
  
Inhibitor
Name:
BDBM50363984
Synonyms:
CHEMBL1949730
Type:
Small organic molecule
Emp. Form.:
C37H49N11O6
Mol. Mass.:
743.8551
SMILES:
[#6]-[#7]-1-[#6@H](-[#6]-[#6]-[#6]\[#7]=[#6](\[#7])-[#7])-[#6](=O)-[#7]-[#6@@H](-[#6]-[#6]-[#6]\[#7]=[#6](\[#7])-[#7])-[#6](=O)-[#7]-[#6@@H](-[#6]-c2ccc3ccccc3c2)-[#6](=O)-[#7]-[#6]-[#6](=O)-[#7]-[#6@H](-[#6]-c2ccc(-[#8])cc2)-[#6]-1=O
: