Target
Adenosine receptor A3
Ligand
BDBM50385631
Substrate
Meas. Tech.
ChEMBL_823418 (CHEMBL2046086)
Ki
>10000±n/a nM
Citation
 El-Tayeb, AMichael, SAbdelrahman, ABehrenswerth, AGollos, SNieber, KMüller, CE Development of Polar Adenosine A2A Receptor Agonists for Inflammatory Bowel Disease: Synergism with A2B Antagonists. ACS Med Chem Lett 2:890-895 (2011)  
Target
Name:
Adenosine receptor A3
Synonyms:
A3 adenosine receptor (hA3) ADORA3 | Adenosine A3 receptor (A3AR)
Type:
G Protein-Coupled Receptor (GPCR)
Mol. Mass.:
36197.32
Organism:
Homo sapiens (Human)
Description:
P0DMS8
Residue:
318
  
Inhibitor
Name:
BDBM50385631
Synonyms:
CHEMBL2043426
Type:
Small organic molecule
Emp. Form.:
C18H21N5O9S2
Mol. Mass.:
515.517
SMILES:
Nc1nc(nc2n(cnc12)[C@@H]1O[C@H](CO)[C@@H](O)[C@H]1O)S(=O)(=O)CCc1ccc(cc1)S(O)(=O)=O
: