Target
Adenosine receptor A2a
Ligand
BDBM50385634
Substrate
Meas. Tech.
ChEMBL_823414 (CHEMBL2046082)
Ki
44.4±n/a nM
Citation
 El-Tayeb, AMichael, SAbdelrahman, ABehrenswerth, AGollos, SNieber, KMüller, CE Development of Polar Adenosine A2A Receptor Agonists for Inflammatory Bowel Disease: Synergism with A2B Antagonists. ACS Med Chem Lett 2:890-895 (2011)  
Target
Name:
Adenosine receptor A2a
Synonyms:
AA2AR_RAT Adenosine A2 receptor Adenosine Receptors A2a (A2a) Adenosine receptors A2a Rat striatal adenosine A2a receptor
Type:
G Protein-Coupled Receptor (GPCR)
Mol. Mass.:
45015.65
Organism:
Rattus norvegicus (rat)
Description:
Rat A2A receptors expressed in CHO cells.
Residue:
410
  
Inhibitor
Name:
BDBM50385634
Synonyms:
CHEMBL2043295
Type:
Small organic molecule
Emp. Form.:
C18H21N5O7S2
Mol. Mass.:
483.519
SMILES:
Nc1nc(SCCc2ccc(cc2)S(O)(=O)=O)nc2n(cnc12)[C@@H]1O[C@H](CO)[C@@H](O)[C@H]1O
: