Target
Smoothened homolog
Ligand
BDBM50385642
Substrate
Meas. Tech.
ChEMBL_825977 (CHEMBL2045142)
IC50
5±n/a nM
Citation
 Munchhof, MJLi, QShavnya, ABorzillo, GVBoyden, TLJones, CSLaGreca, SDMartinez-Alsina, LPatel, NPelletier, KReiter, LARobbins, MDTkalcevic, GT Discovery of PF-04449913, a Potent and Orally Bioavailable Inhibitor of Smoothened. ACS Med Chem Lett 3:106-111 (2012)  
Target
Name:
Smoothened homolog
Synonyms:
SMO_MOUSE Smoh
Type:
PROTEIN
Mol. Mass.:
87472.73
Organism:
Mus musculus
Description:
ChEMBL_1510377
Residue:
793
  
Inhibitor
Name:
BDBM50385642
Synonyms:
CHEMBL2043435
Type:
Small organic molecule
Emp. Form.:
C21H22F3N5O
Mol. Mass.:
417.4275
SMILES:
CN1CC[C@H](C[C@@H]1c1nc2ccccc2[nH]1)NC(=O)Nc1ccc(cc1)C(F)(F)F
: