Target
Mitogen-activated protein kinase 14
Ligand
BDBM50385646
Substrate
Meas. Tech.
ChEMBL_823429 (CHEMBL2046097)
IC50
45±n/a nM
Citation
 Dyrager, CMöllers, LNKjäll, LKAlao, JPDinér, PWallner, FKSunnerhagen, PGrøtli, M Design, synthesis, and biological evaluation of chromone-based p38 MAP kinase inhibitors. J Med Chem 54:7427-31 (2011)  
Target
Name:
Mitogen-activated protein kinase 14
Synonyms:
CSAID-binding protein CSBP1 CSPB1 MAP kinase 14 MAP kinase p38 alpha MAPK14 MK14_HUMAN Mitogen-activated protein kinase p38 alpha Stress-activated protein kinase 2a | p38 MAP kinase alpha/beta
Type:
Serine/threonine-protein kinase
Mol. Mass.:
41286.76
Organism:
Homo sapiens (Human)
Description:
Q16539
Residue:
360
  
Inhibitor
Name:
BDBM50385646
Synonyms:
CHEMBL2041963
Type:
Small organic molecule
Emp. Form.:
C25H21FN2O3
Mol. Mass.:
416.4442
SMILES:
Fc1ccc(cc1)-c1c(oc2ccccc2c1=O)-c1ccnc(NC2CCOCC2)c1
: