Target
Mitogen-activated protein kinase 14
Ligand
BDBM50385650
Substrate
Meas. Tech.
ChEMBL_823429 (CHEMBL2046097)
IC50
21±n/a nM
Citation
 Dyrager, CMöllers, LNKjäll, LKAlao, JPDinér, PWallner, FKSunnerhagen, PGrøtli, M Design, synthesis, and biological evaluation of chromone-based p38 MAP kinase inhibitors. J Med Chem 54:7427-31 (2011)  
Target
Name:
Mitogen-activated protein kinase 14
Synonyms:
CSAID-binding protein CSBP1 CSPB1 MAP kinase 14 MAP kinase p38 alpha MAPK14 MK14_HUMAN Mitogen-activated protein kinase p38 alpha Stress-activated protein kinase 2a | p38 MAP kinase alpha/beta
Type:
Serine/threonine-protein kinase
Mol. Mass.:
41286.76
Organism:
Homo sapiens (Human)
Description:
Q16539
Residue:
360
  
Inhibitor
Name:
BDBM50385650
Synonyms:
CHEMBL2041959
Type:
Small organic molecule
Emp. Form.:
C24H21FN2O2
Mol. Mass.:
388.4341
SMILES:
CCCCNc1cc(ccn1)-c1oc2ccccc2c(=O)c1-c1ccc(F)cc1
: