Target
Muscarinic acetylcholine receptor M1
Ligand
BDBM50385673
Substrate
Meas. Tech.
ChEMBL_826078 (CHEMBL2045509)
Ki
0.794±n/a nM
Citation
 Del Bello, FBarocelli, EBertoni, SBonifazi, ACamalli, MCampi, GGiannella, MMatucci, RNesi, MPigini, MQuaglia, WPiergentili, A 1,4-dioxane, a suitable scaffold for the development of novel M3 muscarinic receptor antagonists. J Med Chem 55:1783-7 (2012)  
Target
Name:
Muscarinic acetylcholine receptor M1
Synonyms:
ACM1_HUMAN Cholinergic receptor, muscarinic 1 | Cholinergic, muscarinic M1
Type:
Protein
Mol. Mass.:
51442.54
Organism:
Homo sapiens (Human)
Description:
P11229
Residue:
460
  
Inhibitor
Name:
BDBM50385673
Synonyms:
CHEMBL2042406
Type:
Small organic molecule
Emp. Form.:
C20H26NO2
Mol. Mass.:
312.4254
SMILES:
C[N+](C)(C)C[C@@H]1COCC(O1)(c1ccccc1)c1ccccc1
: