Target
Aldo-keto reductase family 1 member C2
Ligand
BDBM50337283
Substrate
Meas. Tech.
ChEMBL_823518 (CHEMBL2046256)
IC50
15400±n/a nM
Citation
 Adeniji, AOTwenter, BMByrns, MCJin, YChen, MWinkler, JDPenning, TM Development of potent and selective inhibitors of aldo-keto reductase 1C3 (type 5 17ß-hydroxysteroid dehydrogenase) based on N-phenyl-aminobenzoates and their structure-activity relationships. J Med Chem 55:2311-23 (2012)  
Target
Name:
Aldo-keto reductase family 1 member C2
Synonyms:
3-alpha-HSD3 AK1C2_HUMAN Aldo-keto reductase family 1 member C2 (AK1C2) Aldo-keto reductase family 1 member C2 (AKR1C2) DD-2 DDH2 Dihydrodiol dehydrogenase/bile acid-binding protein Type III 3-alpha-hydroxysteroid dehydrogenase
Type:
Enzyme
Mol. Mass.:
36739.89
Organism:
Homo sapiens (Human)
Description:
Residue:
323
  
Inhibitor
Name:
BDBM50337283
Synonyms:
3-[N-(4-trifluoromethylphenyl)amino]benzoic acid US9271961, 7
Type:
Small organic molecule
Emp. Form.:
C14H10F3NO2
Mol. Mass.:
281.2299
SMILES:
OC(=O)c1cccc(Nc2ccc(cc2)C(F)(F)F)c1
: