Target
Aldo-keto reductase family 1 member C2
Ligand
BDBM50385735
Substrate
Meas. Tech.
ChEMBL_823518 (CHEMBL2046256)
IC50
1330±n/a nM
Citation
 Adeniji, AOTwenter, BMByrns, MCJin, YChen, MWinkler, JDPenning, TM Development of potent and selective inhibitors of aldo-keto reductase 1C3 (type 5 17ß-hydroxysteroid dehydrogenase) based on N-phenyl-aminobenzoates and their structure-activity relationships. J Med Chem 55:2311-23 (2012)  
Target
Name:
Aldo-keto reductase family 1 member C2
Synonyms:
3-alpha-HSD3 AK1C2_HUMAN Aldo-keto reductase family 1 member C2 (AK1C2) Aldo-keto reductase family 1 member C2 (AKR1C2) DD-2 DDH2 Dihydrodiol dehydrogenase/bile acid-binding protein Type III 3-alpha-hydroxysteroid dehydrogenase
Type:
Enzyme
Mol. Mass.:
36739.89
Organism:
Homo sapiens (Human)
Description:
Residue:
323
  
Inhibitor
Name:
BDBM50385735
Synonyms:
CHEMBL2040997
Type:
Small organic molecule
Emp. Form.:
C15H12N2O5
Mol. Mass.:
300.2662
SMILES:
CC(=O)c1ccc(Nc2ccc(cc2)[N+]([O-])=O)c(c1)C(O)=O
: