Target
Prolyl hydroxylase EGLN2
Ligand
BDBM50385792
Substrate
Meas. Tech.
ChEMBL_823544 (CHEMBL2045987)
IC50
3.7±n/a nM
Citation
 Vachal, PMiao, SPierce, JMGuiadeen, DColandrea, VJWyvratt, MJSalowe, SPSonatore, LMMilligan, JAHajdu, RGollapudi, AKeohane, CALingham, RBMandala, SMDeMartino, JATong, XWolff, MSteinhuebel, DKieczykowski, GRFleitz, FJChapman, KAthanasopoulos, JAdam, GAkyuz, CDJena, DKLusen, JWMeng, JStein, BDXia, LSherer, ECHale, JJ 1,3,8-Triazaspiro[4.5]decane-2,4-diones as efficacious pan-inhibitors of hypoxia-inducible factor prolyl hydroxylase 1-3 (HIF PHD1-3) for the treatment of anemia. J Med Chem 55:2945-59 (2012)  
Target
Name:
Prolyl hydroxylase EGLN2
Synonyms:
EGLN2 EIT6 Estrogen-induced tag 6 HIF-PH1 HPH-3 PHD1 Prolyl hydroxylase domain-containing protein 1 (PHD1)
Type:
Protein
Mol. Mass.:
43657.01
Organism:
Homo sapiens (Human)
Description:
Q96KS0
Residue:
407
  
Inhibitor
Name:
BDBM50385792
Synonyms:
CHEMBL2041179
Type:
Small organic molecule
Emp. Form.:
C34H35N7O4
Mol. Mass.:
605.6862
SMILES:
COc1cc(ncn1)N1C(=O)N(C(=O)C11CCN(Cc2ncccc2C)CC1)c1ccc(cc1)-c1ccc(cc1)C(=O)N(C)C
: