Target
17-beta-hydroxysteroid dehydrogenase type 1
Ligand
BDBM50385886
Substrate
Meas. Tech.
ChEMBL_823605 (CHEMBL2044606)
IC50
1009±n/a nM
Citation
 Henn, CEinspanier, AMarchais-Oberwinkler, SFrotscher, MHartmann, RW Lead optimization of 17ß-HSD1 inhibitors of the (hydroxyphenyl)naphthol sulfonamide type for the treatment of endometriosis. J Med Chem 55:3307-18 (2012)  
Target
Name:
17-beta-hydroxysteroid dehydrogenase type 1
Synonyms:
17-beta-HSD 1 17-beta-hydroxysteroid dehydrogenase type 1 20-alpha-HSD E17KSR EDH17B1 EDHB17 Estradiol 17-beta-dehydrogenase 1 (17beta-HSD1) Placental 17-beta-hydroxysteroid dehydrogenase | SDR28C1
Type:
Enzyme
Mol. Mass.:
34945.13
Organism:
Homo sapiens (Human)
Description:
P14061
Residue:
328
  
Inhibitor
Name:
BDBM50385886
Synonyms:
CHEMBL2041374
Type:
Small organic molecule
Emp. Form.:
C28H21NO5S
Mol. Mass.:
483.535
SMILES:
Oc1ccc(cc1)S(=O)(=O)Nc1cccc(c1)-c1c(O)ccc2cc(ccc12)-c1cccc(O)c1
: