Target
Serine/threonine-protein kinase Nek2
Ligand
BDBM50385913
Substrate
Meas. Tech.
ChEMBL_824216 (CHEMBL2044151)
IC50
210±n/a nM
Citation
 Innocenti, PCheung, KMSolanki, SMas-Droux, CRowan, FYeoh, SBoxall, KWestlake, MPickard, LHardy, TBaxter, JEAherne, GWBayliss, RFry, AMHoelder, S Design of potent and selective hybrid inhibitors of the mitotic kinase Nek2: structure-activity relationship, structural biology, and cellular activity. J Med Chem 55:3228-41 (2012)  
Target
Name:
Serine/threonine-protein kinase Nek2
Synonyms:
NEK kinase NEK2A NLK1
Type:
Enzyme
Mol. Mass.:
51776.96
Organism:
Homo sapiens (Human)
Description:
P51955
Residue:
445
  
Inhibitor
Name:
BDBM50385913
Synonyms:
CHEMBL2042032
Type:
Small organic molecule
Emp. Form.:
C30H29F3N4O2
Mol. Mass.:
534.5721
SMILES:
CC(Oc1cc(ccc1C(N)=O)-c1cc(cnc1N)-c1cccc(CN(C)C)c1)c1ccccc1C(F)(F)F
: