Target
Aurora kinase A
Ligand
BDBM50385919
Substrate
Meas. Tech.
ChEMBL_824219 (CHEMBL2044154)
IC50
7930±n/a nM
Citation
 Innocenti, PCheung, KMSolanki, SMas-Droux, CRowan, FYeoh, SBoxall, KWestlake, MPickard, LHardy, TBaxter, JEAherne, GWBayliss, RFry, AMHoelder, S Design of potent and selective hybrid inhibitors of the mitotic kinase Nek2: structure-activity relationship, structural biology, and cellular activity. J Med Chem 55:3228-41 (2012)  
Target
Name:
Aurora kinase A
Synonyms:
AIK ARK1 AURKA AYK1 Aurora kinase A (AURA) Aurora kinase A (Aurora A) Aurora-related kinase 1 BTAK Breast-tumor-amplified kinase STK15 Serine/threonine kinase 15 Serine/threonine-protein kinase aurora A hARK1
Type:
Serine/threonine-protein kinase
Mol. Mass.:
45830.98
Organism:
Homo sapiens (Human)
Description:
O14965
Residue:
403
  
Inhibitor
Name:
BDBM50385919
Synonyms:
CHEMBL2042031
Type:
Small organic molecule
Emp. Form.:
C30H29F3N4O2
Mol. Mass.:
534.5721
SMILES:
CC(Oc1cc(ccc1C(N)=O)-c1cc(cnc1N)-c1ccc(CN(C)C)cc1)c1ccccc1C(F)(F)F
: