Target
Cyclin-dependent kinase 2
Ligand
BDBM50385914
Substrate
Meas. Tech.
ChEMBL_824220 (CHEMBL2044155)
IC50
530±n/a nM
Citation
 Innocenti, PCheung, KMSolanki, SMas-Droux, CRowan, FYeoh, SBoxall, KWestlake, MPickard, LHardy, TBaxter, JEAherne, GWBayliss, RFry, AMHoelder, S Design of potent and selective hybrid inhibitors of the mitotic kinase Nek2: structure-activity relationship, structural biology, and cellular activity. J Med Chem 55:3228-41 (2012)  
Target
Name:
Cyclin-dependent kinase 2
Synonyms:
CDK2 CDK2_HUMAN Cell division protein kinase 2 Protein cereblon/Cyclin-dependent kinase 2 | p33 protein kinase
Type:
Enzyme Subunit
Mol. Mass.:
33938.17
Organism:
Homo sapiens (Human)
Description:
P24941
Residue:
298
  
Inhibitor
Name:
BDBM50385914
Synonyms:
CHEMBL2042042
Type:
Small organic molecule
Emp. Form.:
C24H25F3N4O2S
Mol. Mass.:
490.541
SMILES:
C[C@H](Oc1cc(ccc1C(N)=O)-c1cc(cnc1N)-c1cc(CN(C)C)cs1)\C=C/C(F)(F)F
: