Target
Cathepsin L2
Ligand
BDBM50385984
Substrate
Meas. Tech.
ChEMBL_825263 (CHEMBL2043895)
Ki
800±n/a nM
Citation
 Marques, EFBueno, MADuarte, PDSilva, LRMartinelli, AMdos Santos, CYSeverino, RPBrömme, DVieira, PCCorrêa, AG Evaluation of synthetic acridones and 4-quinolinones as potent inhibitors of cathepsins L and V. Eur J Med Chem 54:10-21 (2012)  
Target
Name:
Cathepsin L2
Synonyms:
CATL2 CTSL2 CTSV Cathepsin V
Type:
Enzyme
Mol. Mass.:
37341.06
Organism:
Homo sapiens (Human)
Description:
O60911
Residue:
334
  
Inhibitor
Name:
BDBM50385984
Synonyms:
CHEMBL2042454
Type:
Small organic molecule
Emp. Form.:
C24H18N2O5
Mol. Mass.:
414.4101
SMILES:
OC(=O)c1cc2ccccc2cc1Nc1ccc(OCc2ccccc2)c(c1)[N+]([O-])=O
: