Target
Chondroitin sulfate N-acetylgalactosaminyltransferase 1
Ligand
BDBM50386137
Substrate
Meas. Tech.
ChEMBL_824644 (CHEMBL2045702)
IC50
54000±n/a nM
Citation
 Jadhav, RDKadam, KSKandre, SGuha, TReddy, MMBrahma, MKDeshmukh, NJDixit, ADoshi, LPotdar, NEnose, AAVishwakarma, RASivaramakrishnan, HSrinivasan, SNemmani, KVGupte, AGangopadhyay, AKSharma, R Synthesis and biological evaluation of isoxazole, oxazole, and oxadiazole containing heteroaryl analogs of biaryl ureas as DGAT1 inhibitors. Eur J Med Chem 54:324-42 (2012)  
Target
Name:
Chondroitin sulfate N-acetylgalactosaminyltransferase 1
Synonyms:
Beta4GalNAcT-1 CHGN Chondroitin beta-1,4-N-acetylgalactosaminyltransferase 1 GALNACT1
Type:
PROTEIN
Mol. Mass.:
61307.78
Organism:
Homo sapiens (Human)
Description:
ChEMBL_824644
Residue:
532
  
Inhibitor
Name:
BDBM50386137
Synonyms:
CHEMBL2042339
Type:
Small organic molecule
Emp. Form.:
C23H21F3N4O5
Mol. Mass.:
490.4318
SMILES:
CC(C)[C@H](NC(=O)c1cc(no1)-c1ccc(NC(=O)Nc2ccccc2C(F)(F)F)cc1)C(O)=O
: