Target
Cytochrome P450 2C19
Ligand
BDBM50156055
Substrate
Meas. Tech.
ChEMBL_824334 (CHEMBL2044476)
IC50
11000±n/a nM
Citation
 Louvet, PSchweizer, DGourdel, MERiguet, EYue, CMarcy, VRLin, YGGruner, JLesur, BBacon, ERChatterjee, S Wake-promoting agents: search for next generation modafinil: part IV. Eur J Med Chem 54:949-51 (2012)  
Target
Name:
Cytochrome P450 2C19
Synonyms:
CP2CJ_HUMAN CYPIIC17 Cytochrome P450 2C19 (CYP2C19) Mephenytoin 4-hydroxylase P450-254C
Type:
Enzyme
Mol. Mass.:
55935.47
Organism:
Homo sapiens (Human)
Description:
P33261
Residue:
490
  
Inhibitor
Name:
BDBM50156055
Synonyms:
2-(Diphenyl-methanesulfinyl)-acetamide 2-[(diphenylmethyl)sulfinyl]acetamide CEP-1538 CRL-40476 Provigil US11555013, Compound (+-)-modafinilb | US9862679, Compound (+-)-modafinil
Type:
Small organic molecule
Emp. Form.:
C15H15NO2S
Mol. Mass.:
273.35
SMILES:
NC(=O)CS(=O)C(c1ccccc1)c1ccccc1
: