Target
Kinesin-like protein KIF11
Ligand
BDBM50386215
Substrate
Meas. Tech.
ChEMBL_824371 (CHEMBL2044661)
IC50
455.8±n/a nM
Citation
 Abualhasan, MNGood, JAWittayanarakul, KAnthony, NGBerretta, GRath, OKozielski, FSutcliffe, OBMackay, SP Doing the methylene shuffle--further insights into the inhibition of mitotic kinesin Eg5 with S-trityl L-cysteine. Eur J Med Chem 54:483-98 (2012)  
Target
Name:
Kinesin-like protein KIF11
Synonyms:
EG5 KIF11_HUMAN Kinesin Spindle Protein Eg5 TRIP5 | kinesin spindle protein
Type:
PROTEIN
Mol. Mass.:
119138.97
Organism:
Homo sapiens (Human)
Description:
ChEMBL_1457426
Residue:
1056
  
Inhibitor
Name:
BDBM50386215
Synonyms:
CHEMBL2043392
Type:
Small organic molecule
Emp. Form.:
C23H22ClNO2S
Mol. Mass.:
411.944
SMILES:
N[C@@H](CSC(Cc1ccc(Cl)cc1)(c1ccccc1)c1ccccc1)C(O)=O
: