Target
Coagulation factor X
Ligand
BDBM50386255
Substrate
Meas. Tech.
ChEMBL_824528 (CHEMBL2045273)
IC50
34000±n/a nM
Citation
 Al-Horani, RAMehta, AYDesai, UR Potent direct inhibitors of factor Xa based on the tetrahydroisoquinoline scaffold. Eur J Med Chem 54:771-83 (2012)  
Target
Name:
Coagulation factor X
Synonyms:
Activated coagulation factor X (FXa) Coagulation factor X precursor F10 Factor X heavy chain Factor Xa Stuart-Prower factor
Type:
Enzyme
Mol. Mass.:
54726.60
Organism:
Homo sapiens (Human)
Description:
Residue:
488
  
Inhibitor
Name:
BDBM50386255
Synonyms:
CHEMBL2040965
Type:
Small organic molecule
Emp. Form.:
C31H33N3O4
Mol. Mass.:
511.6114
SMILES:
COc1ccc(CC(=O)N2Cc3ccccc3C[C@H]2C(=O)N(C)c2ccc(cc2)N2CCCCC2=O)cc1
: