Target
Coagulation factor XI
Ligand
BDBM50386271
Substrate
Meas. Tech.
ChEMBL_824532 (CHEMBL2045415)
IC50
>500000±n/a nM
Citation
 Al-Horani, RAMehta, AYDesai, UR Potent direct inhibitors of factor Xa based on the tetrahydroisoquinoline scaffold. Eur J Med Chem 54:771-83 (2012)  
Target
Name:
Coagulation factor XI
Synonyms:
Coagulation factor XIa Coagulation factor XIa light chain FA11_HUMAN Factor XIa PTA | Plasma thromboplastin antecedent
Type:
Enzyme
Mol. Mass.:
70130.58
Organism:
Homo sapiens (Human)
Description:
P03951
Residue:
625
  
Inhibitor
Name:
BDBM50386271
Synonyms:
CHEMBL2040983
Type:
Small organic molecule
Emp. Form.:
C28H26ClN3O4
Mol. Mass.:
503.977
SMILES:
Clc1ccc(CC(=O)N2Cc3ccccc3C[C@@H]2C(=O)Nc2ccc(cc2)N2CCOCC2=O)cc1
: