Target
Kynurenine/alpha-aminoadipate aminotransferase, mitochondrial
Ligand
BDBM50386310
Substrate
Meas. Tech.
ChEMBL_826599 (CHEMBL2050767)
IC50
137±n/a nM
Citation
 Dounay, ABAnderson, MBechle, BMCampbell, BMClaffey, MMEvdokimov, AEvrard, EFonseca, KRGan, XGhosh, SHayward, MMHorner, WKim, JYMcAllister, LAPandit, JParadis, VParikh, VDReese, MRRong, SSalafia, MASchuyten, KStrick, CATuttle, JBValentine, JWang, HZawadzke, LEVerhoest, PR Discovery of Brain-Penetrant, Irreversible Kynurenine Aminotransferase II Inhibitors for Schizophrenia. ACS Med Chem Lett 3:187-192 (2012)  
Target
Name:
Kynurenine/alpha-aminoadipate aminotransferase, mitochondrial
Synonyms:
AADAT_RAT Kat2 | Kynurenine/alpha-aminoadipate aminotransferase
Type:
PROTEIN
Mol. Mass.:
47788.12
Organism:
Rattus norvegicus
Description:
ChEMBL_826599
Residue:
425
  
Inhibitor
Name:
BDBM50386310
Synonyms:
CHEMBL2049092
Type:
Small organic molecule
Emp. Form.:
C10H12N2O3
Mol. Mass.:
208.2139
SMILES:
COc1ccc2C[C@H](N)C(=O)N(O)c2c1
: