Target
Kynurenine/alpha-aminoadipate aminotransferase, mitochondrial
Ligand
BDBM50386297
Substrate
Meas. Tech.
ChEMBL_826599 (CHEMBL2050767)
IC50
>10000±n/a nM
Citation
 Dounay, ABAnderson, MBechle, BMCampbell, BMClaffey, MMEvdokimov, AEvrard, EFonseca, KRGan, XGhosh, SHayward, MMHorner, WKim, JYMcAllister, LAPandit, JParadis, VParikh, VDReese, MRRong, SSalafia, MASchuyten, KStrick, CATuttle, JBValentine, JWang, HZawadzke, LEVerhoest, PR Discovery of Brain-Penetrant, Irreversible Kynurenine Aminotransferase II Inhibitors for Schizophrenia. ACS Med Chem Lett 3:187-192 (2012)  
Target
Name:
Kynurenine/alpha-aminoadipate aminotransferase, mitochondrial
Synonyms:
AADAT_RAT Kat2 | Kynurenine/alpha-aminoadipate aminotransferase
Type:
PROTEIN
Mol. Mass.:
47788.12
Organism:
Rattus norvegicus
Description:
ChEMBL_826599
Residue:
425
  
Inhibitor
Name:
BDBM50386297
Synonyms:
CHEMBL2049098
Type:
Small organic molecule
Emp. Form.:
C10H12N2O2
Mol. Mass.:
192.2145
SMILES:
Cc1cccc2N(O)C(=O)[C@@H](N)Cc12
: