Target
Histamine H3 receptor
Ligand
BDBM50386351
Substrate
Meas. Tech.
ChEMBL_826696 (CHEMBL2051143)
Ki
5±n/a nM
Citation
 Rao, AUShao, NAslanian, RGChan, TYDegrado, SJWang, LMcKittrick, BSenior, MWest, REWilliams, SMWu, RLHwa, JPatel, BZheng, SSondey, CPalani, A Discovery of a potent thiadiazole class of histamine h3 receptor antagonist for the treatment of diabetes. ACS Med Chem Lett 3:198-202 (2012)  
Target
Name:
Histamine H3 receptor
Synonyms:
HH3R Hrh3
Type:
PROTEIN
Mol. Mass.:
48560.37
Organism:
Mus musculus
Description:
ChEMBL_988451
Residue:
445
  
Inhibitor
Name:
BDBM50386351
Synonyms:
CHEMBL2048589
Type:
Small organic molecule
Emp. Form.:
C22H30N6S
Mol. Mass.:
410.579
SMILES:
C1CCN(CC1)C1CCN(CC1)c1nnc(s1)N1CCCC(=C1)c1ccccn1
: