Target
Mu-type opioid receptor
Ligand
BDBM50386379
Substrate
Meas. Tech.
ChEMBL_826807 (CHEMBL2051428)
Ki
7.5±n/a nM
Citation
 Renton, PGreen, BMaddaford, SRakhit, SAndrews, JS NOpiates: Novel Dual Action Neuronal Nitric Oxide Synthase Inhibitors with µ-Opioid Agonist Activity. ACS Med Chem Lett 3:227-231 (2012)  
Target
Name:
Mu-type opioid receptor
Synonyms:
M-OR-1 MOR-1 MUOR1 Mu opiate receptor OPRM1 hMOP | mu-type opioid receptor isoform MOR-1
Type:
G Protein-Coupled Receptor (GPCR)
Mol. Mass.:
44789.51
Organism:
Homo sapiens (Human)
Description:
P35372
Residue:
400
  
Inhibitor
Name:
BDBM50386379
Synonyms:
CHEMBL2048416
Type:
Small organic molecule
Emp. Form.:
C23H31N7O3
Mol. Mass.:
453.5373
SMILES:
CCOc1ccc(Cc2nc3cc(NC(N)=N[N+]([O-])=O)ccc3n2CCN(CC)CC)cc1
: