Target
Nitric oxide synthase, inducible
Ligand
BDBM50230993
Substrate
Meas. Tech.
ChEMBL_826806 (CHEMBL2051427)
IC50
1.8±n/a nM
Citation
 Renton, PGreen, BMaddaford, SRakhit, SAndrews, JS NOpiates: Novel Dual Action Neuronal Nitric Oxide Synthase Inhibitors with µ-Opioid Agonist Activity. ACS Med Chem Lett 3:227-231 (2012)  
Target
Name:
Nitric oxide synthase, inducible
Synonyms:
HEP-NOS Inducible NO synthase NOS type II NOS2A Nitric oxide synthase, inducible (iNOS) | iNOS
Type:
Homodimer
Mol. Mass.:
131141.95
Organism:
Homo sapiens (Human)
Description:
P35228
Residue:
1153
  
Inhibitor
Name:
BDBM50230993
Synonyms:
(2S)-2-amino-5-[(N-methylcarbamimidoyl)amino]pentanoic acid (R)-2-Amino-5-(N'-methyl-guanidino)-pentanoic acid (S)-2-amino-5-(2-methylguanidino)pentanoic acid 2-Amino-5-(N'-methyl-guanidino)-pentanoic acid L-NMMA N(G)-mono-methyl-L-arginine N-Monomethyl-L-arginine NG-Monomethyl-L-Arginine Ngamma-monomethyl-L-arginine | Targinine
Type:
Small organic molecule
Emp. Form.:
C7H16N4O2
Mol. Mass.:
188.2275
SMILES:
CNC(N)=NCCC[C@H](N)C(O)=O
: