Target
Matrix metalloproteinase-14
Ligand
BDBM50386430
Substrate
Meas. Tech.
ChEMBL_827028 (CHEMBL2050092)
IC50
>20000±n/a nM
Citation
 Gege, CBao, BBluhm, HBoer, JGallagher, BMKorniski, BPowers, TSSteeneck, CTaveras, AGBaragi, VM Discovery and evaluation of a non-Zn chelating, selective matrix metalloproteinase 13 (MMP-13) inhibitor for potential intra-articular treatment of osteoarthritis. J Med Chem 55:709-16 (2012)  
Target
Name:
Matrix metalloproteinase-14
Synonyms:
MMP-14 MMP14 MT-MMP 1 MT1MMP Matrix Metalloproteinase-14 (MMP-14) Matrix metalloproteinase-14 Membrane-type matrix metalloproteinase 1 | Membrane-type-1 matrix metalloproteinase
Type:
Protein
Mol. Mass.:
65900.19
Organism:
Homo sapiens (Human)
Description:
P50281
Residue:
582
  
Inhibitor
Name:
BDBM50386430
Synonyms:
CHEMBL2047536
Type:
Small organic molecule
Emp. Form.:
C28H24N6O6
Mol. Mass.:
540.5268
SMILES:
Cc1c2CC[C@H](NC(=O)c3cc(nc4ccnn34)C(=O)NCc3ccc4OCC(=O)Nc4c3)c2ccc1C(O)=O
: