Target
Beta-secretase 1
Ligand
BDBM50386523
Substrate
Meas. Tech.
ChEMBL_826122 (CHEMBL2049563)
IC50
3530±n/a nM
Citation
 Rueeger, HLueoend, RRogel, ORondeau, JMMöbitz, HMachauer, RJacobson, LStaufenbiel, MDesrayaud, SNeumann, U Discovery of cyclic sulfone hydroxyethylamines as potent and selectiveß-site APP-cleaving enzyme 1 (BACE1) inhibitors: structure-based design and in vivo reduction of amyloidß-peptides. J Med Chem 55:3364-86 (2012)  
Target
Name:
Beta-secretase 1
Synonyms:
ASP2 Aspartyl protease 2 BACE1 Beta-secretase (BACE) Beta-secretase 1 (BACE 1) Beta-secretase 1 (BACE1) Beta-site amyloid precursor protein cleaving enzyme 1 Memapsin-2 beta-Secretase (BACE-1) | beta-Secretase (BACE1)
Type:
Protein
Mol. Mass.:
55755.10
Organism:
Homo sapiens (Human)
Description:
P56817
Residue:
501
  
Inhibitor
Name:
BDBM50386523
Synonyms:
CHEMBL2047901
Type:
Small organic molecule
Emp. Form.:
C30H39F3N2O3S
Mol. Mass.:
564.702
SMILES:
CC(C)(C)c1cccc(CN[C@H]2CS(=O)(=O)C[C@@H](Cc3cc4c(NCC44CCC(F)(F)CC4)c(F)c3)[C@@H]2O)c1
: